ARTICLE · INTELLIGENCE

战地情报 · 详情页

来自尧图项目组的一线实战观察与深度解析

Cortex-M3 DesignStart RTL在FPGA上的集成、仿真与避坑指南

Cortex-M3 DesignStart RTL在FPGA上的集成、仿真与避坑指南

简介:面向嵌入式与FPGA开发者,Arm Cortex M3 DesignStart Kit AT421-MN-80001-r0p0-00rel0是一份ARM官方的完整设计套件,内置32位RISC的Cortex-M3核,采用Thumb-2指令集,用于在FPGA上快速集成与验证处理器逻辑,支持RTOS原型设计,也覆盖工业控制、消费电子等典型场景。包体共611个文件,约14.64MB,Verilog源文件对应IP核逻辑,C/H源码用于驱动与测试程序,makefile和Keil工程文件方便多环境构建,PDF文档为技术手册与使用指南;另有axf固件和bin文件可直接仿真或上板运行。已有1069人学习下载。资源内含IP核、参考设计、开发工具链及文档,示例工程覆盖自检、GPIO、定时器等外设驱动,可帮助开发者深入理解Cortex-M3的指令集特点、中断处理、调试接口与MPU机制;配合FPGA可重配置特性,能快速搭建验证流程,评估M3性能和功耗,缩短原型迭代周期。同时,随包资料也能梳理从启动到外设配置的完整设计路径,适合系统学习ARM M3设计或进行定制SoC评估的中高级开发者。

1. 拿到了某公司官方 Cortex-M3 DesignStart Kit:拆开 tgz 的那一刻

第一次解压 AT421-MN-80001-r0p0-00rel0.tgz 时,很多人会误以为里面装的只是仿真模型或文档包,实则不然——这份 tarball 里是 Cortex-M3 处理器的完整可综合 RTL 设计文件。换句话说,拿到它,你手里就有一份可以在 FPGA 上真实跑起来的 ARM M3 CPU 核心,不只是看波形、跑跑测试那么浅,而是能直接放进你自己的 SoC 工程里做集成验证。对于做嵌入式底层验证的工程师、SoC 前端设计的新手,以及高校里想拿真实处理器核心做教学实验的人,这个资源的价值在于把「CPU 源头设计」这件平时捂得很严实的事情摊开了。本篇文章不聊 PPT 上的性能数字,围绕这份资源的实际内容、复现路径以及我踩过的坑展开。

2. DesignStart 包内文件结构:从 RTL 目录到 AHB-Lite 总线集成点

2.1 拆包与文件架构:第一轮要读的关键目录

这份包的命名本身就透露出不少信息:AT421-MN-80001 是产品编号,r0p0 是构建版本标识,00rel0 是发布序号。拿到手的第一步不是急着打开 PDF,而是把 tar 包解压并建立对目录结构的第一印象。

tar -xzf AT421-MN-80001-r0p0-00rel0.tgz cd AT421-MN-80001-r0p0-00rel0 find . -maxdepth 2 -type d | sort

执行之后你会看到若干个顶层目录。按我拆过类似资源的经验,重点关注的通常是这三个:一个是rtl或类似名字的目录,存放 Cortex-M3 的完整 RTL 源文件;一个是sim/testbench相关目录,里面是官方自带的仿真环境和测试用例;还有一个是doc目录,里面放着集成手册和信号描述文档。初次接触该资源时,我建议按照「先读文档、再看仿真、最后过 RTL」的节奏推进,不要一上来就冲进代码堆里。

常见做法是先把文档里关于顶层模块端口描述的部分过一遍。这份资源里 Cortex-M3 以可综合 RTL 的形式提供,顶层模块的对外接口中,与总线相关的信号线是需要最先识别的。端口方向、位宽、以及是否有带内握手信号,都会直接影响你后续把它接入自家总线的方式。建议第一轮阅读时拿张纸画出模块端口图,标注清楚地址总线、数据总线、控制信号与中断相关引脚,这一步能省掉后面大量对照代码查端口的时间。

2.2 Cortex-M3 的 AHB-Lite 接口与 SoC 集成位置

Cortex-M3 对外总线接口使用的是 AHB-Lite,这是一种相对简洁的单通道总线协议。和 AXI 相比,AHB-Lite 少了独立的读写通道、没有突发传输的复杂握手,结构上更接近「地址 + 数据 + 控制」三组信号并行推进的形态。选择 AHB-Lite 的原因很直接:Cortex-M3 面向的是微控制器级 SoC,外设和存储控制器的带宽需求远低于应用处理器场景,使用简化版总线可以在不大幅牺牲性能的前提下大幅降低集成复杂度。

从 SoC 集成的视角看,拿到这份 RTL 之后你通常有两种去向:一是把它作为主设备,挂在 AHB-Lite 总线上控制 Flash、SRAM 和外设,这也是最标准的微控制器内部结构;二是通过总线桥把它接到 AXI 域,用于某些需要更高带宽的异构系统。前者适合快速验证内核功能,后者适合把 M3 作为控制核心塞进一个更大的 SoC 中。选择哪一种,取决于你现有的总线基础设施。

接口层面有一点容易忽略——Cortex-M3 除了 AHB-Lite 主接口外,还带有一个紧耦合的私有外设总线,用于连接 NVIC 中断控制器、调试组件等。这部分在集成时如果不接对,系统可能在启动早期就出现异常行为,而问题表象往往非常隐蔽。我的习惯是先跑通官方自带的 testbench,确认内核本身工作正常,再开始动总线集成。这个顺序能有效缩小排查范围,避免把「内核配置错」和「总线接错」混在一起排查。

2.3 从 RTL 到仿真:包自带 testbench 的用法

资源包通常会附带一个最小可用的仿真环境,这份包也不例外。用自带的 testbench 跑通一次完整仿真,是验证你本地工具链是否兼容 RTL 代码的最快途径。仿真环境一般包含处理器核、一块 SRAM 模型、以及一段预加载的启动代码,能让你看到从复位向量取指到进入主程序的完整过程。

# 以常见的仿真器为例,编译 RTL 与 testbench vlib work vlog -work work ./rtl/*.v ./sim/testbench/*.v vsim -c work.tb_top -do "run 100us; quit"

这段命令的核心逻辑是:先建立工作库,再把 RTL 源文件和测试平台一起编译进去,最后用批处理模式跑一段仿真时间并退出。参数-c表示命令行模式,适合无界面环境下做回归;run 100us是仿真时长,100 微秒在这类处理器仿真里足够完成复位释放、取指、执行一小段代码的流程。仿真跑完后,可以打开波形窗口查看复位释放后的第一个取指地址是否落在线性 Flash 映射区,这是判断内核是否正常工作的初步依据。

这里有个值得注意的细节:跑仿真前需要确认 testbench 里是否有$readmemh之类的系统任务加载初始化镜像,以及该镜像的路径是否正确。不少开发者在这一步会因为路径不匹配而看到一片高阻态波形,第一反应往往是代码问题,实际上是内存没有被正确初始化。

3. 在 FPGA 上把 CPU 跑起来:建工程、跑仿真、串口打印全流程

3.1 创建 FPGA 工程与 RTL 文件导入顺序

仿真通过后,下一步就是在 FPGA 上真实运行。这里以常见的某款 FPGA 开发板为例,核心思路是创建一个新的 FPGA 工程,把 DesignStart 的 RTL 文件按依赖顺序加入工程。文件导入顺序本身不影响综合结果,但合理分组会显著提升后续排查效率。我一般把文件分为四组:处理器核 RTL、总线与存储控制器、外设组件、顶层集成文件。

// 顶层模块的简化示例:例化 Cortex-M3 并连接 AHB-Lite 总线 module fpga_top ( input wire clk_50m, input wire rst_n, output wire [7:0] led ); // 时钟与复位 wire cpu_clk; wire cpu_rst_n; // AHB-Lite 信号组 wire [31:0] haddr; wire [1:0] hsize; wire [2:0] hburst; wire hwrite; wire [31:0] hwdata; wire [31:0] hrdata; wire hready; wire hresp; // 时钟管理:根据开发板实际晶振频率调整分频或倍频参数 clk_gen u_clk_gen ( .clk_in (clk_50m), .clk_out (cpu_clk), .rst_out (cpu_rst_n) ); // 例化 M3 内核 cortex_m3 u_cpu ( .HCLK (cpu_clk), .HRESETn (cpu_rst_n), .HADDR (haddr), .HWRITE (hwrite), .HSIZE (hsize), .HBURST (hburst), .HWDATA (hwdata), .HRDATA (hrdata), .HREADY (hready), .HRESP (hresp) ); // 内存与外设的 AHB-Lite 连接由实际的互联逻辑完成 endmodule

上面的代码展示的是顶层集成的骨架,实际使用时还需要补充 AHB-Lite 译码器和存储控制器。关键在于HREADY信号的处理——AHB-Lite 协议中从设备通过拉低HREADY来插入等待周期,若处理器访问的外设不支持等待,系统会因握手无法完成而挂死。另一个容易出问题的是复位信号极性,Cortex-M3 使用低电平复位,某些开发板上的按键复位电路默认上拉,直接连接会导致内核永远处于复位状态。

3.2 内存初始化与启动代码:hello world 的最小可运行镜像

处理器核在 FPGA 上工作时,需要一段真实的启动代码来完成栈指针初始化、跳转主函数、控制外设输出等操作。这个过程和通常的嵌入式开发略有区别:FPGA 上的 SRAM 是易失性存储,掉电后内容丢失,因此每次上电都需要重新加载程序镜像。有两种常见加载方式:一是通过 FPGA 厂商工具把初始化数据合入比特流,二是上电后由外部主机通过调试接口写入。

# 将编译出的 hex 文件转换为 FPGA 工具可识别的初始化文件 # 以常见的 .mem 格式为例,需要把地址和校验信息去掉,只保留纯数据 objcopy -I ihex -O binary hello.hex hello.bin srec_cat hello.bin -binary -offset 0 -o hello.mem -Vmem

生成初始化文件之后,要在 FPGA 工程的存储模块配置中指定该文件路径。参数方面需要关注两点:一是数据位宽要匹配 SRAM 的实际位宽(通常 32 位或 8 位),二是地址映射要与内核的线性映射一致。若配置错位,最直观的现象是处理器从复位向量读到的指令是垃圾数据,导致取指后立刻进入 HardFault——波形上表现为HADDR停在一个固定地址附近循环。

3.3 综合布局布线与时序约束:时钟、复位、异步信号的坑

FPGA 工程走到综合布局布线阶段后,真正的技术难点才开始显形。Cortex-M3 的 RTL 代码虽然可以被综合,但时序约束需要你根据实际设计自行补齐。最基础的约束包括时钟约束和复位约束。若缺少正确的时钟约束,工具默认按理想时钟计算时序,综合结果可能在真实器件上出现频率不达预期的情况。经验值来看,Cortex-M3 在常见的入门级 FPGA 器件上能跑到 50~80MHz,再高就得看具体逻辑路径和工具优化力度了。

# 时序约束示例 create_clock -name cpu_clk -period 20.0 [get_ports {clk_50m}] set_input_delay -clock cpu_clk 5.0 [get_ports {rst_n}]

period 20.0对应 50MHz 时钟,这里以开发板实际晶振频率为准。set_input_delay约束的是外部引脚相对时钟边沿的数据到达时间,若实际硬件走线较长且未加此约束,工具在布局时可能过度乐观。另一个常被忽视的地方是异步信号同步,外部按键、拨码开关产生的信号如果不经两级触发器同步直接进入内核时钟域,会产生亚稳态,表现为运行一段时间后随机崩溃。这类问题在仿真阶段几乎无法复现,只有在线实验时才会暴露,排查起来极其消耗时间。

4. 避坑排查:三条血泪经验与一条授权边界

4.1 现象:综合报错,提示某些参数非法

原因:r0p0 版本的 RTL 中,部分可配置参数在实际综合时存在边界限制。严格来说这并非内核 bug,而是文档与 RTL 默认配置之间存在一处不一致,涉及乘法器或除法器的硬件实现选择。如果使用默认参数,某些综合工具会报出参数越界的警告,严重时直接终止综合。

解决:打开 RTL 中的参数定义文件,将硬件乘除法器相关的宏或参数改为显式指定值。我的经验是以资源包自带的仿真配置为基准,仿真能过就用同一套参数去综合,不要自行「优化」参数。改动前务必对照文档确认该参数对流水线级数的影响——改错了 CPU 行为可能变化,而功能仿真因为时序原因未必能暴露差异。

4.2 现象:FPGA 上电后 LED 状态全亮,处理器无响应

原因:SRAM 初始化文件的格式与实际内存模型不匹配。这颗 Cortex-M3 的 AHB-Lite 接口是 32 位数据总线,但 SRAM 布成 4 个字节使能分开控制的方式。初始化文件若按 8 位宽格式导入,地址会错位,处理器从复位向量读到的是错位拼接后的数据。

解决:确认工具链生成的初始化文件位宽与 SRAM 位宽一致,不一致时用替换脚本预处理。之后在仿真环境里重新跑一遍内存加载过程,检查复位后第一个取指地址处的数据是否为合法的 ARM 指令编码。这个检查虽然简单,却能在烧写之前拦截掉八成以上「上电无反应」的问题。

4.3 现象:仿真挂死,HADDR停在某地址不发生跳变

原因:AHB-Lite 的从设备端HREADY信号处理不当。默认情况下,从设备应在收到地址后拉低HREADY插入等待,并在数据准备好后释放。若从设备逻辑中HREADY只拉低一个周期就不再变化,主设备将永远等待,仿真时间推进但总线不前进,整体呈「挂死」状态。

解决:检查从设备的HREADY状态机,确保其能在无数据传输时保持高电平,在总线忙时按需拉低。更简单的排查手段是在 testbench 中直接给HREADY强制拉高,跳过所有等待周期,借以判断问题出在内核侧还是外设侧。这一招在处理总线相关故障时非常高效,属于可以反复使用的定位手段。

4.4 现象:把 RTL 拿去流片,收到合规通知

原因:DesignStart 授权协议限定的使用范围是评估、教学与原型验证,明确覆盖 FPGA 集成和仿真用途,但不允许直接用于商业流片。这并非技术问题,而是授权边界问题。不少开发者在 FPGA 上验证完就自然想到「直接拿去流片省一笔授权费」,却忽略了协议条款的限制。

解决:在使用前通读授权文档,明确 FPGA 原型、教学实验、商业流片三者的界限。若所在单位有流片计划,需要走完整的商业授权流程,不要在协议之外试探。这条经验看似与「技术」无关,却是这类资源使用中最容易触碰的红线,值得在起步阶段就当回事。

5. 进阶用法:把 M3 挂进自有 SoC 总线的两种做法

5.1 方案一:AHB-Lite 转 AXI 桥接,把 M3 塞进 AXI 域

如果你的现有 SoC 采用 AXI 总线,而你又希望将 Cortex-M3 作为控制核心加入,就需要在 AHB-Lite 与 AXI 之间架一座桥。常见的做法是写一个状态机负责跨协议转换。AHB-Lite 的优势在于简单:地址、读写控制、数据在同一周期内并行推进,转换成 AXI 时,只需按 AXI 的握手规则把单次传输适配成 INCR 突发长度为 1 的读或写事务。

// AHB-Lite 到 AXI 转换桥的状态机分段示例 localparam IDLE = 2'b00, DO_READ = 2'b01, DO_WRITE = 2'b10; always @(posedge clk or negedge rst_n) begin if (!rst_n) begin state <= IDLE; end else begin case (state) IDLE: begin if (hready && htrans != 2'b00) begin if (hwrite) state <= DO_WRITE; else state <= DO_READ; end end DO_READ: begin // 等待 AXI 读数据返回,同时回填 HREADY 给 M3 侧 if (axi_rvalid) state <= IDLE; end DO_WRITE: begin // 等待 AXI 写响应,完成后拉高 HREADY 结束本次事务 if (axi_wready && axi_bvalid) state <= IDLE; end endcase end end

桥上需要注意的细节有两个。一是等待周期处理:AXI 的读通道允许插入任意延迟,但 AHB-Lite 侧靠HREADY拉低来等待,桥的时序必须保证HREADY的释放时机与 AXI 侧数据返回对齐,否则会造成多传或少传一拍。二是转换效率:建议将 AHB-Lite 的单个写传输映射为 AXI 的AWVALID单次脉冲,不要尝试把多次 AHB-Lite 传输打包成一次 AXI 突发,因为 M3 的访问模式对打包场景并无刚需,简单反而可靠。

5.2 方案二:保留 AHB-Lite 直连,跑一遍 CoreMark 看真实性能

如果现有外设接口都是简单的 SRAM 或寄存器模型,没必要引入 AXI 域,直接在 AHB-Lite 上挂一块 SRAM 作为程序存储、再挂一组 GPIO 作为输出即可。但跑通不代表性能达标,我的一般做法是在此基础上移植 CoreMark 做一次真实的性能摸底。

CoreMark 属于计算密集型基准,对存储带宽敏感,恰好能考验 M3 在 AHB-Lite 总线上的实际取指效率。移植时需要关注两点:一是确保 CoreMark 的堆栈和全局变量放在快速 SRAM 中,避免引入额外的等待周期;二是关闭编译器的优化选项之前先记录基线分数,再逐步打开优化,观察得分变化是否合理。若优化后得分没有提升,大概率是总线上存在隐藏的访问瓶颈。

记得把HREADY时序放在检查列表的前排。在 FPGA 上可以通过 ChipScope 或逻辑分析仪抓取 HREADY 拉低的周期数,统计总线等待占全部访问周期的比例。若等待比例超过一定阈值,优先考虑调整地址译码逻辑、拆分存储映射,而不是加大缓存。我见过不少案例,性能不达标并非处理器核本身的问题,而是总线等待在拖后腿,改完译码后得分明显好转。

从那以后,我每收到一份处理器 RTL 资源,都不会直接跑仿真看波形就完事,而是强制走一遍「拆包——过文档——跑通 testbench——接入总线——性能摸底」的完整流程,确保每一个环节都在可控范围内。这套方法在 M3 上验证过有效,放到别的处理器资源上同样适用。希望这份笔记能帮你少走几步弯路。

本文还有配套的精品资源,点击获取

RELATED READING

延伸阅读

更多一线实战笔记与深度复盘,助您持续精进